Chinaunix首页 | 论坛 | 博客
  • 博客访问: 457570
  • 博文数量: 74
  • 博客积分: 988
  • 博客等级: 准尉
  • 技术积分: 1259
  • 用 户 组: 普通用户
  • 注册时间: 2011-05-10 15:44
文章分类

全部博文(74)

文章存档

2019年(1)

2018年(1)

2016年(9)

2015年(7)

2013年(6)

2012年(40)

2011年(10)

分类: LINUX

2012-03-27 21:17:32

在之前的源码下载完成后,进入source目录,执行make
root@gavin-laptop:/home/gavin/Android/source# make
============================================
PLATFORM_VERSION_CODENAME=AOSP
PLATFORM_VERSION=4.0.3.0.2.0.1.0
TARGET_PRODUCT=full
TARGET_BUILD_VARIANT=eng
TARGET_BUILD_TYPE=release
TARGET_BUILD_APPS=
TARGET_ARCH=arm
TARGET_ARCH_VARIANT=armv7-a
HOST_ARCH=x86
HOST_OS=linux
HOST_OS_EXTRA=Linux-2.6.32-39-generic-x86_64-with-Ubuntu-10.04-lucid
HOST_BUILD_TYPE=release
BUILD_ID=OPENMASTER
OUT_DIR=out
============================================
Checking build tools versions...
host Java: jsr305lib (out/host/common/obj/JAVA_LIBRARIES/jsr305lib_intermediates/classes)
host Java: guavalib (out/host/common/obj/JAVA_LIBRARIES/guavalib_intermediates/classes)
Header: out/host/linux-x86/obj/include/libexpat/expat.h
Header: out/host/linux-x86/obj/include/libexpat/expat_external.h
Header: out/target/product/generic/obj/include/libexpat/expat.h
Header: out/target/product/generic/obj/include/libexpat/expat_external.h
Header: out/host/linux-x86/obj/include/libpng/png.h
Header: out/host/linux-x86/obj/include/libpng/pngconf.h
Header: out/host/linux-x86/obj/include/libpng/pngusr.h
Header: out/target/product/generic/obj/include/libpng/png.h
Header: out/target/product/generic/obj/include/libpng/pngconf.h
Header: out/target/product/generic/obj/include/libpng/pngusr.h
Header: out/target/product/generic/obj/include/libsonivox/eas.h
Header: out/target/product/generic/obj/include/libsonivox/eas_types.h
Header: out/target/product/generic/obj/include/libsonivox/eas_reverb.h
Header: out/target/product/generic/obj/include/libsonivox/jet.h
Header: out/target/product/generic/obj/include/libsonivox/ARM_synth_constants_gnu.inc
Header: out/target/product/generic/obj/include/libwpa_client/wpa_ctrl.h
host C: acp <= build/tools/acp/acp.c
host C++: libhost <= build/libs/host/pseudolocalize.cpp
host C: libhost <= build/libs/host/CopyFile.c
host StaticLib: libhost (out/host/linux-x86/obj/STATIC_LIBRARIES/libhost_intermediates/libhost.a)
host Executable: acp (out/host/linux-x86/obj/EXECUTABLES/acp_intermediates/acp)
/usr/bin/ld: skipping incompatible /usr/lib/gcc/x86_64-linux-gnu/4.4.3/libstdc++.so when searching for -lstdc++
/usr/bin/ld: skipping incompatible /usr/lib/gcc/x86_64-linux-gnu/4.4.3/libstdc++.a when searching for -lstdc++
/usr/bin/ld: skipping incompatible /usr/lib/gcc/x86_64-linux-gnu/4.4.3/libstdc++.so when searching for -lstdc++
/usr/bin/ld: skipping incompatible /usr/lib/gcc/x86_64-linux-gnu/4.4.3/libstdc++.a when searching for -lstdc++
/usr/bin/ld: cannot find -lstdc++
collect2: ld returned 1 exit status
make: *** [out/host/linux-x86/obj/EXECUTABLES/acp_intermediates/acp] Error 1

出错了,在网上找到解决办法,顺便把别人出错的地方也贴出来,红色部分是我的出问题的地方,可能是由于用64位系统的原因吧。
uname -a
Linux gavin-laptop 2.6.32-39-generic #86-Ubuntu SMP Mon Feb 13 21:50:08 UTC 2012 x86_64 GNU/Linux

错误:
/usr/include/gnu/stubs.h:7:27: error: gnu/stubs-32.h: No such file or directory

 

make: *** [out/host/linux-x86/obj/EXECUTABLES/acp_intermediates/acp.o] 错误 1

解决:
  sudo apt-get install libc6-dev-i386

错误:
make: *** [out/host/linux-x86/obj/EXECUTABLES/acp_intermediates/acp] error 1

解决:
  sudo apt-get install g++-multilib

错误:
external/clearsilver/cgi/cgi.c:22: fatal error: zlib.h: No such file or directory
compilation terminated.
make: *** [out/host/linux-x86/obj/SHARED_LIBRARIES/libneo_cgi_intermediates/cgi.o] Error 1

解决:
sudo apt-get install zlib1g-dev


错误:   /* 解决红色错误后又出现的新错误 */
/usr/bin/ld: cannot find -lz
collect2: ld returned 1 exit status
make: *** [out/host/linux-x86/obj/EXECUTABLES/aapt_intermediates/aapt] Error 1

解决:
sudo apt-get install lib32z1-dev


错误:
bison -d  -oout/host/linux-x86/obj/EXECUTABLES/aidl_intermediates/aidl_language_y.cppframeworks/base/tools/aidl/aidl_language_y.y
/bin/bash: bison: command not found
make: *** [out/host/linux-x86/obj/EXECUTABLES/aidl_intermediates/aidl_language_y.cpp] Error 127

解决:
sudo apt-get install bison


错误:
Lex: aidl <= frameworks/base/tools/aidl/aidl_language_l.l
/bin/bash: flex: command not found
make: *** [out/host/linux-x86/obj/EXECUTABLES/aidl_intermediates/aidl_language_l.cpp] Error 127

解决:
sudo apt-get install flex


错误:
/usr/bin/ld: cannot find -lncurses
collect2: ld returned 1 exit status
make: *** [out/host/linux-x86/obj/EXECUTABLES/adb_intermediates/adb] Error 1

解决:
sudo apt-get install lib32ncurses5-dev


错误:
prebuilt/linux-x86/sdl/include/SDL/SDL_syswm.h:55: fatal error: X11/Xlib.h: No such file or directory
compilation terminated.
make: *** [out/host/linux-x86/obj/EXECUTABLES/emulator_intermediates/Android/main-common.o] Error 1

解决:
sudo apt-get install libx11-dev

错误:
sh: gperf: not found
calling gperf failed: 32512 at ./makeprop.pl line 96.
make: *** [out/target/product/generic/obj/STATIC_LIBRARIES/libwebcore_intermediates/WebCore/css/CSSPropertyNames.h] Error 25
make:*** Deleting file`out/target/product/generic/obj/STATIC_LIBRARIES/libwebcore_intermediates/WebCore/css/CSSPropertyNames.h'

解决:
sudo apt-get install gperf

解决以上两个问题后,就开始编译了,虽然过程中有过一些警告,不去处理也没有影响,具体的编译时间也不太清楚,开始编译了就去睡觉了,早上起来就编译好了,从文件生成的时间来看,应该是四个小时左右。Generated: (out/target/product/generic/android-info.txt)
Installed file list: out/target/product/generic/installed-files.txt
Target system fs image: out/target/product/generic/obj/PACKAGING/systemimage_intermediates/system.img
Install system fs image: out/target/product/generic/system.img
Target ram disk: out/target/product/generic/ramdisk.img
Target userdata fs image: out/target/product/generic/userdata.img
编译完成后,在source目录下会生成一个out文件夹,在out/target/product/generic/下是生成的system.img,ramdisk.img,userdata.img.




阅读(9824) | 评论(4) | 转发(2) |
给主人留下些什么吧!~~

jiaweijing2012-03-30 10:56:12

重返人生: 好多错误呀…….....
那两个处理了就没有了。

jiaweijing2012-03-29 21:52:21

重返人生: 好多错误呀…….....
我的出了两个错误,就是红色和粉色的

jiaweijing2012-03-29 21:52:19

重返人生: 好多错误呀…….....
我的出了两个错误,就是红色和粉色的

重返人生2012-03-28 22:23:58

好多错误呀……